{"text_format":"3","workbook":"xlsx","n_sheets":2,"sheets":["Impreso de Licencias","Resumen"],"not_rendered":{"images":2,"defined_names":1,"comments":1},"read":"whole","date_system":"1900"}

{"sheet":"Impreso de Licencias","index":0,"n_rows":50,"n_cols":25,"rows_kept":50,"merged":[[0,0,0,1],[0,3,0,4],[0,7,0,14],[1,2,1,3],[1,5,1,7],[1,18,1,20],[2,2,2,3],[3,5,3,7],[3,18,4,20],[4,5,5,9],[5,0,5,2],[5,18,5,20],[6,0,8,0],[6,1,8,1],[6,2,8,2],[6,3,8,3],[6,4,8,4],[6,5,8,5],[6,6,8,6],[6,7,8,7],[6,8,6,13],[6,14,8,14],[6,18,7,20],[7,8,7,10],[7,11,7,13],[8,15,8,17]]}
[{"$nulls":3},2021,null,"Firma y Sello del Club"]
[null,"CLUB O ENTIDAD: ",{"$nulls":3},{"$f":"IF(ISBLANK(A10),\"\",IF(CELL(\"contenido\",S4)<>\"\",CELL(\"contenido\",S4),CELL(\"contenido\",S6)))","v":""},{"$nulls":10},"Margen de fecha","Sexo (H/M)","Texto de errores"]
[null,"DOMICILIO CLUB: ",{"$f":"IF(C2=\"\",\"\",LOOKUP(C2,V26:V45,W26:W45))","v":""},{"$nulls":13},{"$f":"TODAY()","v":"2020-12-30"},"H"]
[null,"POBLACION:",{"$f":"IF(C2=\"\",\"\",LOOKUP(C2,V26:V45,Y26:Y45))","v":""},{"$f":"IF(C2=\"\",\"\",LOOKUP(C2,V26:V35,X26:X35))","v":""},null,{"$f":"IF(OR(C2=\"\",C3=\"\",C4=\"\",D4=\"\",C5=\"\"),\"Termina de rellenar la Cabecera\",\"\")","v":"Termina de rellenar la Cabecera"},{"$nulls":10},{"$f":"Q3-C5","v":"2020-12-30"},"M",{"$f":"IF(SUM(P10:P48)=\"\",\"\",IF(SUM(P10:P48)>=1,\"Introduce una sola opción\",\"\"))","v":""}]
[null,"FECHA:",{"$nulls":3},{"$f":"S7","v":""},{"$nulls":10},{"$f":"IF((Q4>15),1,\"\")","v":1}]
[{"$f":"IF(AND(Q5=1,Q6=1),\"Actualiza la fecha de la Cabecera\",\"\")","v":""},{"$nulls":15},{"$f":"IF((A10=\"\"),0,1)","v":0},null,{"$f":"IF(SUM(Q10:Q48)=\"\",\"\",IF(SUM(Q10:Q48)>=1,\"Has marcado varias opciones\",\"\"))","v":""}]
["DNI/NIF","NOMBRE","APELLIDOS","FECHA NAC.","SEXO (H/M)","DIRECCION","C.P.","POBLACION","LICENCIA",{"$nulls":5},"E-mail",{"$nulls":3},{"$f":"IF(SUM(R10:R48)=\"\",\"\",IF(SUM(R10:R48)<>0,\"Introduce la Fecha de Nacimiento\",\"\"))","v":""}]
[{"$nulls":8},"BASICA",null,null,"PLUS"]
[{"$nulls":8},"A","B","B1","A","B","B1",null,"Códigos de error",{"$nulls":3},{"$f":"IF((D26=\"\"),\"\",DATEDIF(D26,C5,\"Y\"))","v":""}]
[{"$nulls":15},{"$f":"IF(A10=\"\",\"\",IF(COUNTA(I10:N10)=0,1,\"\"))","v":""},{"$f":"IF(A10=\"\",\"\",IF(COUNTA(I10:N10)>1,1,\"\"))","v":""},{"$f":"IF(OR(ISBLANK(A10),ISBLANK(B10),ISBLANK(C10)),\"\",IF(ISBLANK(D10),1,\"\"))","v":""},null,{"$f":"IF((D10=\"\"),\"\",DATEDIF(D10,$C$5,\"Y\"))","v":""}]
[{"$nulls":15},"","",{"$f":"IF(OR(ISBLANK(A11),ISBLANK(B11),ISBLANK(#REF!)),\"\",IF(ISBLANK(D11),1,\"\"))","v":""},null,{"$f":"IF((D11=\"\"),\"\",DATEDIF(D11,$C$5,\"Y\"))","v":""}]
[{"$nulls":15},"","",{"$f":"IF(OR(ISBLANK(A12),ISBLANK(B12),ISBLANK(#REF!)),\"\",IF(ISBLANK(D12),1,\"\"))","v":""},null,""]
[{"$nulls":15},"","",{"$f":"IF(OR(ISBLANK(A13),ISBLANK(B13),ISBLANK(#REF!)),\"\",IF(ISBLANK(D13),1,\"\"))","v":""},null,""]
[{"$nulls":15},"","",{"$f":"IF(OR(ISBLANK(A14),ISBLANK(B14),ISBLANK(#REF!)),\"\",IF(ISBLANK(D14),1,\"\"))","v":""},null,""]
[{"$nulls":15},"","",{"$f":"IF(OR(ISBLANK(A15),ISBLANK(B15),ISBLANK(#REF!)),\"\",IF(ISBLANK(D15),1,\"\"))","v":""},null,""]
{"$rows_left_out":36}
{"sheet":"Resumen","index":1,"n_rows":46,"n_cols":37,"rows_kept":46,"merged":[[0,1,0,3],[0,4,0,5],[0,20,1,23],[0,26,1,30],[1,1,1,3],[1,32,1,35],[2,1,3,1],[2,2,3,2],[2,3,3,3],[2,4,3,4],[2,5,3,5],[2,6,3,6],[2,7,3,7],[2,8,3,8],[2,9,3,9],[2,10,3,10],[2,11,3,16],[2,17,3,17],[2,32,2,35],[4,11,4,16],[4,32,4,36],[5,11,5,16],[5,32,6,36],[6,11,6,16],[7,11,7,16],[8,11,8,16],[8,32,8,36],[9,11,9,16],[9,32,10,36],[10,11,10,16],[10,20,10,22],[11,11,11,16],[11,20,11,22],[11,26,12,28],[11,29,12,30],[11,32,11,36],[12,11,12,16],[12,20,12,22],[12,32,12,36],[13,11,13,16],[13,26,14,30],[14,11,14,16],[14,20,15,25],[15,11,15,16],[16,11,16,16],[17,11,17,16],[18,11,18,16],[19,11,19,16],[20,11,20,16],[21,11,21,16],[22,11,22,16],[23,11,23,16],[24,11,24,16],[25,11,25,16],[26,11,26,16],[27,11,27,16],[28,11,28,16],[29,11,29,16],[30,11,30,16],[31,11,31,16],[32,11,32,16],[33,11,33,16],[34,11,34,16],[35,11,35,16],[36,11,36,16],[37,11,37,16],[38,11,38,16],[39,11,39,16],[40,11,40,16],[41,11,41,16],[42,11,42,16],[43,11,43,16],[44,11,44,16],[45,11,45,16]]}
[null,"LISTADO DE FEDERADOS ",null,null," Fecha del informe",null,{"$f":"'Impreso de Licencias'!C5","v":"00:00:00"},{"$nulls":13},{"$f":"CONCATENATE(\"Precio de las Licencias \",'Impreso de Licencias'!D1)","v":"Precio de las Licencias 2021"},{"$nulls":5},"Desglose de mis licencias"]
[null," Licencias expedidas desde ",{"$nulls":3}," hasta ",{"$nulls":26},"Total a Ingresar ……………….………",{"$nulls":3},{"$f":"(AC4*V4)+(AD4*W4)+(AE4*X4)+(AC5*V5)+(AD5*W5)+(AE5*X5)+(AC6*V6)+(AD6*W6)+(AE6*X6)+(AC7*V7)+(AD7*W7)+(AE7*X7)+(AC8*V8)+(AD8*W8)+(AE8*X8)+(AC9*V9)+(AD9*W9)+(AE9*X9)","v":{"v":0,"d":"0 €"}}]
[null,"D.N.I.","Nombre","Apellidos","Fecha Nacimiento","Fecha Expedición","Categoria","Tipo de licencia","Dirección","C.P.","Población","Entidad Deportiva",{"$nulls":5},"SEXO (H/M)",{"$nulls":3},"Mayores   (> 18 años)","Juveniles (14 a 17 años)","Infantiles (hasta 13 años)",{"$nulls":4},"Mayor","Juvenil","Infantil"]
[{"$nulls":20},"Básica A",{"v":44,"d":"44 €"},{"v":20,"d":"20 €"},{"v":15,"d":"15 €"},null,null,"Licencias Básica A",null,{"$f":"SUMPRODUCT((Resumen!H5:H46=\"Básica A\")*(G5:G46=\"Mayor\")*1)","v":0},{"$f":"SUMPRODUCT((H5:H46=\"Básica A\")*(G5:G46=\"Juvenil\")*1)","v":0},{"$f":"SUMPRODUCT((H5:H46=\"Básica A\")*(G5:G46=\"Infantil\")*1)","v":0}]
[null,{"$f":"IF('Impreso de Licencias'!A10=\"\",\"\",CELL(\"contenido\",'Impreso de Licencias'!A10))","v":""},{"$f":"IF('Impreso de Licencias'!A10=\"\",\"\",PROPER((CELL(\"contenido\",'Impreso de Licencias'!B10))))","v":""},{"$f":"IF('Impreso de Licencias'!A10=\"\",\"\",PROPER((CELL(\"contenido\",'Impreso de Licencias'!C10))))","v":""},{"$f":"IF('Impreso de Licencias'!A10=\"\",\"\",CELL(\"contenido\",'Impreso de Licencias'!D10))","v":""},{"$f":"IF(B5=\"\",\"\",IF($G$1=\"\",\"\",$G$1))","v":""},{"$f":"IF(B5=\"\",\"\",IF('Impreso de Licencias'!T10>=18,\"Mayor\",IF('Impreso de Licencias'!T10>=14,\"Juvenil\",\"Infantil\")))","v":""},{"$f":"IF(B5=\"\",\"\",IF(MATCH(\"X\",'Impreso de Licencias'!I10:N10,0)=1,\"Básica A\",IF(MATCH(\"X\",'Impreso de Licencias'!I10:N10,0)=2,\"Básica B\",IF(MATCH(\"X\",'Impreso de Licencias'!I10:N10,0)=3,\"Básica B1\",IF(MATCH(\"X\",'Impreso de Licencias'!I10:N10,0)=4,\"Plus A\",IF(MATCH(\"X\",'Impreso de Licencias'!I10:N10,0)=5,\"Plus B\",IF(MATCH(\"X\",'Impreso de Licencias'!I10:N10,0)=6,\"Plus B1\")))))))","v":""},{"$f":"IF('Impreso de Licencias'!A10=\"\",\"\",PROPER((CELL(\"contenido\",'Impreso de Licencias'!F10))))","v":""},{"$f":"IF('Impreso de Licencias'!A10=\"\",\"\",CELL(\"contenido\",'Impreso de Licencias'!G10))","v":""},{"$f":"IF('Impreso de Licencias'!A10=\"\",\"\",PROPER((CELL(\"contenido\",'Impreso de Licencias'!H10))))","v":""},{"$f":"IF('Impreso de Licencias'!A10=\"\",\"\",'Impreso de Licencias'!$C$2)","v":""},{"$nulls":5},{"$f":"IF('Impreso de Licencias'!A10=\"\",\"\",PROPER((CELL(\"contenido\",'Impreso de Licencias'!E10))))","v":""},null,null,"Básica B",{"v":58,"d":"58 €"},{"v":33,"d":"33 €"},{"v":28,"d":"28 €"},null,null,"Licencias Básica B",null,{"$f":"SUMPRODUCT((H5:H46=\"Básica B\")*(G5:G46=\"Mayor\")*1)","v":0},{"$f":"SUMPRODUCT((H5:H46=\"Básica B\")*(G5:G46=\"Juvenil\")*1)","v":0},{"$f":"SUMPRODUCT((H5:H46=\"Básica B\")*(G5:G46=\"Infantil\")*1)","v":0},null,"Ingresar en LIBERBANK (Caja Cantabria)"]
[null,{"$f":"IF('Impreso de Licencias'!A11=\"\",\"\",CELL(\"contenido\",'Impreso de Licencias'!A11))","v":""},{"$f":"IF('Impreso de Licencias'!A11=\"\",\"\",PROPER((CELL(\"contenido\",'Impreso de Licencias'!B11))))","v":""},{"$f":"IF('Impreso de Licencias'!A11=\"\",\"\",PROPER((CELL(\"contenido\",'Impreso de Licencias'!C11))))","v":""},{"$f":"IF('Impreso de Licencias'!A11=\"\",\"\",CELL(\"contenido\",'Impreso de Licencias'!D11))","v":""},{"$f":"IF(B6=\"\",\"\",IF($G$1=\"\",\"\",$G$1))","v":""},{"$f":"IF(B6=\"\",\"\",IF('Impreso de Licencias'!T11>=18,\"Mayor\",IF('Impreso de Licencias'!T11>=14,\"Juvenil\",\"Infantil\")))","v":""},{"$f":"IF(B6=\"\",\"\",IF(MATCH(\"X\",'Impreso de Licencias'!I11:N11,0)=1,\"Básica A\",IF(MATCH(\"X\",'Impreso de Licencias'!I11:N11,0)=2,\"Básica B\",IF(MATCH(\"X\",'Impreso de Licencias'!I11:N11,0)=3,\"Básica B1\",IF(MATCH(\"X\",'Impreso de Licencias'!I11:N11,0)=4,\"Plus A\",IF(MATCH(\"X\",'Impreso de Licencias'!I11:N11,0)=5,\"Plus B\",IF(MATCH(\"X\",'Impreso de Licencias'!I11:N11,0)=6,\"Plus B1\")))))))","v":""},{"$f":"IF('Impreso de Licencias'!A11=\"\",\"\",PROPER((CELL(\"contenido\",'Impreso de Licencias'!F11))))","v":""},{"$f":"IF('Impreso de Licencias'!A11=\"\",\"\",CELL(\"contenido\",'Impreso de Licencias'!G11))","v":""},{"$f":"IF('Impreso de Licencias'!A11=\"\",\"\",PROPER((CELL(\"contenido\",'Impreso de Licencias'!H11))))","v":""},{"$f":"IF('Impreso de Licencias'!A11=\"\",\"\",'Impreso de Licencias'!$C$2)","v":""},{"$nulls":5},{"$f":"IF('Impreso de Licencias'!A11=\"\",\"\",PROPER((CELL(\"contenido\",'Impreso de Licencias'!E11))))","v":""},null,null,"Básica B1",{"v":72,"d":"72 €"},{"v":65,"d":"65 €"},{"v":58,"d":"58 €"},null,null,"Licencias Básica B1",null,{"$f":"SUMPRODUCT((H5:H46=\"Básica B1\")*(G5:G46=\"Mayor\")*1)","v":0},{"$f":"SUMPRODUCT((H5:H46=\"Básica B1\")*(G5:G46=\"Juvenil\")*1)","v":0},{"$f":"SUMPRODUCT((H5:H46=\"Básica B1\")*(G5:G46=\"Infantil\")*1)","v":0},null,"ES58 2048 2015 6634 0003 1431"]
[null,{"$f":"IF('Impreso de Licencias'!A12=\"\",\"\",CELL(\"contenido\",'Impreso de Licencias'!A12))","v":""},{"$f":"IF('Impreso de Licencias'!A12=\"\",\"\",PROPER((CELL(\"contenido\",'Impreso de Licencias'!B12))))","v":""},{"$f":"IF('Impreso de Licencias'!A12=\"\",\"\",PROPER((CELL(\"contenido\",'Impreso de Licencias'!C12))))","v":""},{"$f":"IF('Impreso de Licencias'!A12=\"\",\"\",CELL(\"contenido\",'Impreso de Licencias'!D12))","v":""},"",{"$f":"IF(B7=\"\",\"\",IF('Impreso de Licencias'!T12>=18,\"Mayor\",IF('Impreso de Licencias'!T12>=14,\"Juvenil\",\"Infantil\")))","v":""},{"$f":"IF(B7=\"\",\"\",IF(MATCH(\"X\",'Impreso de Licencias'!I12:N12,0)=1,\"Básica A\",IF(MATCH(\"X\",'Impreso de Licencias'!I12:N12,0)=2,\"Básica B\",IF(MATCH(\"X\",'Impreso de Licencias'!I12:N12,0)=3,\"Básica B1\",IF(MATCH(\"X\",'Impreso de Licencias'!I12:N12,0)=4,\"Plus A\",IF(MATCH(\"X\",'Impreso de Licencias'!I12:N12,0)=5,\"Plus B\",IF(MATCH(\"X\",'Impreso de Licencias'!I12:N12,0)=6,\"Plus B1\")))))))","v":""},{"$f":"IF('Impreso de Licencias'!A12=\"\",\"\",PROPER((CELL(\"contenido\",'Impreso de Licencias'!F12))))","v":""},{"$f":"IF('Impreso de Licencias'!A12=\"\",\"\",CELL(\"contenido\",'Impreso de Licencias'!G12))","v":""},{"$f":"IF('Impreso de Licencias'!A12=\"\",\"\",PROPER((CELL(\"contenido\",'Impreso de Licencias'!H12))))","v":""},{"$f":"IF('Impreso de Licencias'!A12=\"\",\"\",'Impreso de Licencias'!$C$2)","v":""},{"$nulls":5},{"$f":"IF('Impreso de Licencias'!A12=\"\",\"\",PROPER((CELL(\"contenido\",'Impreso de Licencias'!E12))))","v":""},null,null,"Plus A",{"v":82,"d":"82 €"},{"v":67,"d":"67 €"},{"v":60,"d":"60 €"},null,null,"Licencias Plus A",null,{"$f":"SUMPRODUCT((H5:H46=\"Plus A\")*(G5:G46=\"Mayor\")*1)","v":0},{"$f":"SUMPRODUCT((H5:H46=\"Plus A\")*(G5:G46=\"Juvenil\")*1)","v":0},{"$f":"SUMPRODUCT((H5:H46=\"Plus A\")*(G5:G46=\"Infantil\")*1)","v":0}]
[null,{"$f":"IF('Impreso de Licencias'!A13=\"\",\"\",CELL(\"contenido\",'Impreso de Licencias'!A13))","v":""},{"$f":"IF('Impreso de Licencias'!A13=\"\",\"\",PROPER((CELL(\"contenido\",'Impreso de Licencias'!B13))))","v":""},{"$f":"IF('Impreso de Licencias'!A13=\"\",\"\",PROPER((CELL(\"contenido\",'Impreso de Licencias'!C13))))","v":""},{"$f":"IF('Impreso de Licencias'!A13=\"\",\"\",CELL(\"contenido\",'Impreso de Licencias'!D13))","v":""},"",{"$f":"IF(B8=\"\",\"\",IF('Impreso de Licencias'!T13>=18,\"Mayor\",IF('Impreso de Licencias'!T13>=14,\"Juvenil\",\"Infantil\")))","v":""},{"$f":"IF(B8=\"\",\"\",IF(MATCH(\"X\",'Impreso de Licencias'!I13:N13,0)=1,\"Básica A\",IF(MATCH(\"X\",'Impreso de Licencias'!I13:N13,0)=2,\"Básica B\",IF(MATCH(\"X\",'Impreso de Licencias'!I13:N13,0)=3,\"Básica B1\",IF(MATCH(\"X\",'Impreso de Licencias'!I13:N13,0)=4,\"Plus A\",IF(MATCH(\"X\",'Impreso de Licencias'!I13:N13,0)=5,\"Plus B\",IF(MATCH(\"X\",'Impreso de Licencias'!I13:N13,0)=6,\"Plus B1\")))))))","v":""},{"$f":"IF('Impreso de Licencias'!A13=\"\",\"\",PROPER((CELL(\"contenido\",'Impreso de Licencias'!F13))))","v":""},{"$f":"IF('Impreso de Licencias'!A13=\"\",\"\",CELL(\"contenido\",'Impreso de Licencias'!G13))","v":""},{"$f":"IF('Impreso de Licencias'!A13=\"\",\"\",PROPER((CELL(\"contenido\",'Impreso de Licencias'!H13))))","v":""},{"$f":"IF('Impreso de Licencias'!A13=\"\",\"\",'Impreso de Licencias'!$C$2)","v":""},{"$nulls":5},{"$f":"IF('Impreso de Licencias'!A13=\"\",\"\",PROPER((CELL(\"contenido\",'Impreso de Licencias'!E13))))","v":""},null,null,"Plus B",{"v":89,"d":"89 €"},{"v":74,"d":"74 €"},{"v":65,"d":"65 €"},null,null,"Licencias Plus B",null,{"$f":"SUMPRODUCT((H5:H46=\"Plus B\")*(G5:G46=\"Mayor\")*1)","v":0},{"$f":"SUMPRODUCT((H5:H46=\"Plus B\")*(G5:G46=\"Juvenil\")*1)","v":0},{"$f":"SUMPRODUCT((H5:H46=\"Plus B\")*(G5:G46=\"Infantil\")*1)","v":0}]
[null,{"$f":"IF('Impreso de Licencias'!A14=\"\",\"\",CELL(\"contenido\",'Impreso de Licencias'!A14))","v":""},{"$f":"IF('Impreso de Licencias'!A14=\"\",\"\",PROPER((CELL(\"contenido\",'Impreso de Licencias'!B14))))","v":""},{"$f":"IF('Impreso de Licencias'!A14=\"\",\"\",PROPER((CELL(\"contenido\",'Impreso de Licencias'!C14))))","v":""},{"$f":"IF('Impreso de Licencias'!A14=\"\",\"\",CELL(\"contenido\",'Impreso de Licencias'!D14))","v":""},"",{"$f":"IF(B9=\"\",\"\",IF('Impreso de Licencias'!T14>=18,\"Mayor\",IF('Impreso de Licencias'!T14>=14,\"Juvenil\",\"Infantil\")))","v":""},{"$f":"IF(B9=\"\",\"\",IF(MATCH(\"X\",'Impreso de Licencias'!I14:N14,0)=1,\"Básica A\",IF(MATCH(\"X\",'Impreso de Licencias'!I14:N14,0)=2,\"Básica B\",IF(MATCH(\"X\",'Impreso de Licencias'!I14:N14,0)=3,\"Básica B1\",IF(MATCH(\"X\",'Impreso de Licencias'!I14:N14,0)=4,\"Plus A\",IF(MATCH(\"X\",'Impreso de Licencias'!I14:N14,0)=5,\"Plus B\",IF(MATCH(\"X\",'Impreso de Licencias'!I14:N14,0)=6,\"Plus B1\")))))))","v":""},{"$f":"IF('Impreso de Licencias'!A14=\"\",\"\",PROPER((CELL(\"contenido\",'Impreso de Licencias'!F14))))","v":""},{"$f":"IF('Impreso de Licencias'!A14=\"\",\"\",CELL(\"contenido\",'Impreso de Licencias'!G14))","v":""},{"$f":"IF('Impreso de Licencias'!A14=\"\",\"\",PROPER((CELL(\"contenido\",'Impreso de Licencias'!H14))))","v":""},{"$f":"IF('Impreso de Licencias'!A14=\"\",\"\",'Impreso de Licencias'!$C$2)","v":""},{"$nulls":5},{"$f":"IF('Impreso de Licencias'!A14=\"\",\"\",PROPER((CELL(\"contenido\",'Impreso de Licencias'!E14))))","v":""},null,null,"Plus B1",{"v":126,"d":"126 €"},{"v":118,"d":"118 €"},{"v":115,"d":"115 €"},null,null,"Licencias Plus B1",null,{"$f":"SUMPRODUCT((H5:H46=\"Plus B1\")*(G5:G46=\"Mayor\")*1)","v":0},{"$f":"SUMPRODUCT((H5:H46=\"Plus B1\")*(G5:G46=\"Juvenil\")*1)","v":0},{"$f":"SUMPRODUCT((H5:H46=\"Plus B1\")*(G5:G46=\"Infantil\")*1)","v":0},null,"Enviar archivo y justificante del pago a la dirección"]
[null,{"$f":"IF('Impreso de Licencias'!A15=\"\",\"\",CELL(\"contenido\",'Impreso de Licencias'!A15))","v":""},{"$f":"IF('Impreso de Licencias'!A15=\"\",\"\",PROPER((CELL(\"contenido\",'Impreso de Licencias'!B15))))","v":""},{"$f":"IF('Impreso de Licencias'!A15=\"\",\"\",PROPER((CELL(\"contenido\",'Impreso de Licencias'!C15))))","v":""},{"$f":"IF('Impreso de Licencias'!A15=\"\",\"\",CELL(\"contenido\",'Impreso de Licencias'!D15))","v":""},"",{"$f":"IF(B10=\"\",\"\",IF('Impreso de Licencias'!T15>=18,\"Mayor\",IF('Impreso de Licencias'!T15>=14,\"Juvenil\",\"Infantil\")))","v":""},{"$f":"IF(B10=\"\",\"\",IF(MATCH(\"X\",'Impreso de Licencias'!I15:N15,0)=1,\"Básica A\",IF(MATCH(\"X\",'Impreso de Licencias'!I15:N15,0)=2,\"Básica B\",IF(MATCH(\"X\",'Impreso de Licencias'!I15:N15,0)=3,\"Básica B1\",IF(MATCH(\"X\",'Impreso de Licencias'!I15:N15,0)=4,\"Plus A\",IF(MATCH(\"X\",'Impreso de Licencias'!I15:N15,0)=5,\"Plus B\",IF(MATCH(\"X\",'Impreso de Licencias'!I15:N15,0)=6,\"Plus B1\")))))))","v":""},{"$f":"IF('Impreso de Licencias'!A15=\"\",\"\",PROPER((CELL(\"contenido\",'Impreso de Licencias'!F15))))","v":""},{"$f":"IF('Impreso de Licencias'!A15=\"\",\"\",CELL(\"contenido\",'Impreso de Licencias'!G15))","v":""},{"$f":"IF('Impreso de Licencias'!A15=\"\",\"\",PROPER((CELL(\"contenido\",'Impreso de Licencias'!H15))))","v":""},{"$f":"IF('Impreso de Licencias'!A15=\"\",\"\",'Impreso de Licencias'!$C$2)","v":""},{"$nulls":5},{"$f":"IF('Impreso de Licencias'!A15=\"\",\"\",PROPER((CELL(\"contenido\",'Impreso de Licencias'!E15))))","v":""},{"$nulls":14},"licencias@espeleocantabria.net"]
[null,{"$f":"IF('Impreso de Licencias'!A16=\"\",\"\",CELL(\"contenido\",'Impreso de Licencias'!A16))","v":""},{"$f":"IF('Impreso de Licencias'!A16=\"\",\"\",PROPER((CELL(\"contenido\",'Impreso de Licencias'!B16))))","v":""},{"$f":"IF('Impreso de Licencias'!A16=\"\",\"\",PROPER((CELL(\"contenido\",'Impreso de Licencias'!C16))))","v":""},{"$f":"IF('Impreso de Licencias'!A16=\"\",\"\",CELL(\"contenido\",'Impreso de Licencias'!D16))","v":""},"",{"$f":"IF(B11=\"\",\"\",IF('Impreso de Licencias'!T16>=18,\"Mayor\",IF('Impreso de Licencias'!T16>=14,\"Juvenil\",\"Infantil\")))","v":""},{"$f":"IF(B11=\"\",\"\",IF(MATCH(\"X\",'Impreso de Licencias'!I16:N16,0)=1,\"Básica A\",IF(MATCH(\"X\",'Impreso de Licencias'!I16:N16,0)=2,\"Básica B\",IF(MATCH(\"X\",'Impreso de Licencias'!I16:N16,0)=3,\"Básica B1\",IF(MATCH(\"X\",'Impreso de Licencias'!I16:N16,0)=4,\"Plus A\",IF(MATCH(\"X\",'Impreso de Licencias'!I16:N16,0)=5,\"Plus B\",IF(MATCH(\"X\",'Impreso de Licencias'!I16:N16,0)=6,\"Plus B1\")))))))","v":""},{"$f":"IF('Impreso de Licencias'!A16=\"\",\"\",PROPER((CELL(\"contenido\",'Impreso de Licencias'!F16))))","v":""},{"$f":"IF('Impreso de Licencias'!A16=\"\",\"\",CELL(\"contenido\",'Impreso de Licencias'!G16))","v":""},{"$f":"IF('Impreso de Licencias'!A16=\"\",\"\",PROPER((CELL(\"contenido\",'Impreso de Licencias'!H16))))","v":""},{"$f":"IF('Impreso de Licencias'!A16=\"\",\"\",'Impreso de Licencias'!$C$2)","v":""},{"$nulls":5},{"$f":"IF('Impreso de Licencias'!A16=\"\",\"\",PROPER((CELL(\"contenido\",'Impreso de Licencias'!E16))))","v":""},null,null,"Licencias de fin de semana (3 días)",null,null,{"v":12,"d":"12 €"}]
[null,{"$f":"IF('Impreso de Licencias'!A17=\"\",\"\",CELL(\"contenido\",'Impreso de Licencias'!A17))","v":""},{"$f":"IF('Impreso de Licencias'!A17=\"\",\"\",PROPER((CELL(\"contenido\",'Impreso de Licencias'!B17))))","v":""},{"$f":"IF('Impreso de Licencias'!A17=\"\",\"\",PROPER((CELL(\"contenido\",'Impreso de Licencias'!C17))))","v":""},{"$f":"IF('Impreso de Licencias'!A17=\"\",\"\",CELL(\"contenido\",'Impreso de Licencias'!D17))","v":""},"",{"$f":"IF(B12=\"\",\"\",IF('Impreso de Licencias'!T17>=18,\"Mayor\",IF('Impreso de Licencias'!T17>=14,\"Juvenil\",\"Infantil\")))","v":""},{"$f":"IF(B12=\"\",\"\",IF(MATCH(\"X\",'Impreso de Licencias'!I17:N17,0)=1,\"Básica A\",IF(MATCH(\"X\",'Impreso de Licencias'!I17:N17,0)=2,\"Básica B\",IF(MATCH(\"X\",'Impreso de Licencias'!I17:N17,0)=3,\"Básica B1\",IF(MATCH(\"X\",'Impreso de Licencias'!I17:N17,0)=4,\"Plus A\",IF(MATCH(\"X\",'Impreso de Licencias'!I17:N17,0)=5,\"Plus B\",IF(MATCH(\"X\",'Impreso de Licencias'!I17:N17,0)=6,\"Plus B1\")))))))","v":""},{"$f":"IF('Impreso de Licencias'!A17=\"\",\"\",PROPER((CELL(\"contenido\",'Impreso de Licencias'!F17))))","v":""},{"$f":"IF('Impreso de Licencias'!A17=\"\",\"\",CELL(\"contenido\",'Impreso de Licencias'!G17))","v":""},{"$f":"IF('Impreso de Licencias'!A17=\"\",\"\",PROPER((CELL(\"contenido\",'Impreso de Licencias'!H17))))","v":""},{"$f":"IF('Impreso de Licencias'!A17=\"\",\"\",'Impreso de Licencias'!$C$2)","v":""},{"$nulls":5},{"$f":"IF('Impreso de Licencias'!A17=\"\",\"\",PROPER((CELL(\"contenido\",'Impreso de Licencias'!E17))))","v":""},null,null,"Cuota de Club*",null,null,{"v":30,"d":"30 €"},null,null,"Total federados",null,null,{"$f":"AC4+AD4+AE4+AC5+AD5+AE5+AC6+AD6+AE6+AC7+AD7+AE7+AC8+AD8+AE8+AC9+AD9+AE9","v":0},null,null,"Enviar el archivo con el nombre:"]
[null,{"$f":"IF('Impreso de Licencias'!A18=\"\",\"\",CELL(\"contenido\",'Impreso de Licencias'!A18))","v":""},{"$f":"IF('Impreso de Licencias'!A18=\"\",\"\",PROPER((CELL(\"contenido\",'Impreso de Licencias'!B18))))","v":""},{"$f":"IF('Impreso de Licencias'!A18=\"\",\"\",PROPER((CELL(\"contenido\",'Impreso de Licencias'!C18))))","v":""},{"$f":"IF('Impreso de Licencias'!A18=\"\",\"\",CELL(\"contenido\",'Impreso de Licencias'!D18))","v":""},"",{"$f":"IF(B13=\"\",\"\",IF('Impreso de Licencias'!T18>=18,\"Mayor\",IF('Impreso de Licencias'!T18>=14,\"Juvenil\",\"Infantil\")))","v":""},{"$f":"IF(B13=\"\",\"\",IF(MATCH(\"X\",'Impreso de Licencias'!I18:N18,0)=1,\"Básica A\",IF(MATCH(\"X\",'Impreso de Licencias'!I18:N18,0)=2,\"Básica B\",IF(MATCH(\"X\",'Impreso de Licencias'!I18:N18,0)=3,\"Básica B1\",IF(MATCH(\"X\",'Impreso de Licencias'!I18:N18,0)=4,\"Plus A\",IF(MATCH(\"X\",'Impreso de Licencias'!I18:N18,0)=5,\"Plus B\",IF(MATCH(\"X\",'Impreso de Licencias'!I18:N18,0)=6,\"Plus B1\")))))))","v":""},{"$f":"IF('Impreso de Licencias'!A18=\"\",\"\",PROPER((CELL(\"contenido\",'Impreso de Licencias'!F18))))","v":""},{"$f":"IF('Impreso de Licencias'!A18=\"\",\"\",CELL(\"contenido\",'Impreso de Licencias'!G18))","v":""},{"$f":"IF('Impreso de Licencias'!A18=\"\",\"\",PROPER((CELL(\"contenido\",'Impreso de Licencias'!H18))))","v":""},{"$f":"IF('Impreso de Licencias'!A18=\"\",\"\",'Impreso de Licencias'!$C$2)","v":""},{"$nulls":5},{"$f":"IF('Impreso de Licencias'!A18=\"\",\"\",PROPER((CELL(\"contenido\",'Impreso de Licencias'!E18))))","v":""},null,null,"Otoñal (septiembre a diciembre) Cursos",null,null,{"v":28,"d":"28 €"},{"$nulls":8}," LICENCIAS_migrupo_01 / 02 /…"]
[null,{"$f":"IF('Impreso de Licencias'!A19=\"\",\"\",CELL(\"contenido\",'Impreso de Licencias'!A19))","v":""},{"$f":"IF('Impreso de Licencias'!A19=\"\",\"\",PROPER((CELL(\"contenido\",'Impreso de Licencias'!B19))))","v":""},{"$f":"IF('Impreso de Licencias'!A19=\"\",\"\",PROPER((CELL(\"contenido\",'Impreso de Licencias'!C19))))","v":""},{"$f":"IF('Impreso de Licencias'!A19=\"\",\"\",CELL(\"contenido\",'Impreso de Licencias'!D19))","v":""},"",{"$f":"IF(B14=\"\",\"\",IF('Impreso de Licencias'!T19>=18,\"Mayor\",IF('Impreso de Licencias'!T19>=14,\"Juvenil\",\"Infantil\")))","v":""},{"$f":"IF(B14=\"\",\"\",IF(MATCH(\"X\",'Impreso de Licencias'!I19:N19,0)=1,\"Básica A\",IF(MATCH(\"X\",'Impreso de Licencias'!I19:N19,0)=2,\"Básica B\",IF(MATCH(\"X\",'Impreso de Licencias'!I19:N19,0)=3,\"Básica B1\",IF(MATCH(\"X\",'Impreso de Licencias'!I19:N19,0)=4,\"Plus A\",IF(MATCH(\"X\",'Impreso de Licencias'!I19:N19,0)=5,\"Plus B\",IF(MATCH(\"X\",'Impreso de Licencias'!I19:N19,0)=6,\"Plus B1\")))))))","v":""},{"$f":"IF('Impreso de Licencias'!A19=\"\",\"\",PROPER((CELL(\"contenido\",'Impreso de Licencias'!F19))))","v":""},{"$f":"IF('Impreso de Licencias'!A19=\"\",\"\",CELL(\"contenido\",'Impreso de Licencias'!G19))","v":""},{"$f":"IF('Impreso de Licencias'!A19=\"\",\"\",PROPER((CELL(\"contenido\",'Impreso de Licencias'!H19))))","v":""},{"$f":"IF('Impreso de Licencias'!A19=\"\",\"\",'Impreso de Licencias'!$C$2)","v":""},{"$nulls":5},{"$f":"IF('Impreso de Licencias'!A19=\"\",\"\",PROPER((CELL(\"contenido\",'Impreso de Licencias'!E19))))","v":""},{"$nulls":8},{"$f":"IF(ISNA(AC4),\"Revisa el impreso de Licencias está incompleto\",\"\")","v":""}]
[null,{"$f":"IF('Impreso de Licencias'!A20=\"\",\"\",CELL(\"contenido\",'Impreso de Licencias'!A20))","v":""},{"$f":"IF('Impreso de Licencias'!A20=\"\",\"\",PROPER((CELL(\"contenido\",'Impreso de Licencias'!B20))))","v":""},{"$f":"IF('Impreso de Licencias'!A20=\"\",\"\",PROPER((CELL(\"contenido\",'Impreso de Licencias'!C20))))","v":""},{"$f":"IF('Impreso de Licencias'!A20=\"\",\"\",CELL(\"contenido\",'Impreso de Licencias'!D20))","v":""},"",{"$f":"IF(B15=\"\",\"\",IF('Impreso de Licencias'!T20>=18,\"Mayor\",IF('Impreso de Licencias'!T20>=14,\"Juvenil\",\"Infantil\")))","v":""},{"$f":"IF(B15=\"\",\"\",IF(MATCH(\"X\",'Impreso de Licencias'!I20:N20,0)=1,\"Básica A\",IF(MATCH(\"X\",'Impreso de Licencias'!I20:N20,0)=2,\"Básica B\",IF(MATCH(\"X\",'Impreso de Licencias'!I20:N20,0)=3,\"Básica B1\",IF(MATCH(\"X\",'Impreso de Licencias'!I20:N20,0)=4,\"Plus A\",IF(MATCH(\"X\",'Impreso de Licencias'!I20:N20,0)=5,\"Plus B\",IF(MATCH(\"X\",'Impreso de Licencias'!I20:N20,0)=6,\"Plus B1\")))))))","v":""},{"$f":"IF('Impreso de Licencias'!A20=\"\",\"\",PROPER((CELL(\"contenido\",'Impreso de Licencias'!F20))))","v":""},{"$f":"IF('Impreso de Licencias'!A20=\"\",\"\",CELL(\"contenido\",'Impreso de Licencias'!G20))","v":""},{"$f":"IF('Impreso de Licencias'!A20=\"\",\"\",PROPER((CELL(\"contenido\",'Impreso de Licencias'!H20))))","v":""},{"$f":"IF('Impreso de Licencias'!A20=\"\",\"\",'Impreso de Licencias'!$C$2)","v":""},{"$nulls":5},{"$f":"IF('Impreso de Licencias'!A20=\"\",\"\",PROPER((CELL(\"contenido\",'Impreso de Licencias'!E20))))","v":""},null,null,"*La cuota de club se debe ingresar por separado por transferencia a la cuenta de la FCE"]
{"$rows_left_out":31}